{"text_format":"1","workbook":"xlsx","n_sheets":13,"sheets":["Estimation","TSW","TSG","TSB","TSK","TSC","TSO","DBG","DCB","CDW","CTG","CWO","NSB"],"not_rendered":{"charts":0,"images":3,"macros":1,"external_links":0,"defined_names":48,"comments":0,"pivot_tables":0},"unopened":[],"bounds":{"document_bytes":16777216,"sheet_cells":100000,"rows_first":2000,"rows_last":500,"rows_between":2000,"halvings":0,"cell_chars":16384,"cell_head_chars":4096},"cells_cut":0,"cells_raw":0,"read":"whole","date_system":"1900"}

{"sheet":"Estimation","index":0,"n_rows":502,"n_cols":10,"rows_kept":502,"cut":false,"hidden":false,"merged":[[0,0,0,9],[1,6,1,9],[2,1,2,2],[3,1,3,2],[4,1,4,2],[5,1,5,2],[6,1,6,2],[11,8,11,9]]}
["ESTIMATION"]
[]
["Company Name:",null,null,null,null,"Multiplier:",0.41,null,"Products:",{"$f":"SUM($J$14:$J$1048576)","v":0}]
["Customer PO#:",null,null,null,null,"Tax Rate:",0.0,null," Tax：",{"$f":"J3*G4","v":0}]
["Project Name:",null,null,null,null,"Qty(Panel & RT):",0.0]
["Ship Address:",null,null,null,null,"Qty(Base & Wall):",0.0,null,"Assembly:",{"$f":"G5*6+G6*20+G7*30","v":0}]
["Delivery Contact:",null,null,null,null,"Qty(Pantry & Corner):",0.0]
[null,null,null,null,null,"Delivery Fee:",250.0,null,"Delivery:",{"$f":"G8","v":250}]
[null,null,null,null,null,"Modification Fee:",null,null,"Modification:",""]
[]
[null,null,null,null,null,null,null,null,"Total:",{"$f":"J3+J4+J6+J8+J9","v":250}]
[]
["STYLE","ITEM","DESCRIPTION","QTY","FINISHED END","HINGES","UNITS TYPE","RATE","UNIT PRICE\n","SUBTOTAL"]
[null,null,{"$f":"IFERROR(IF(B14=\"\",\"\",VLOOKUP(B14,INDIRECT(A14&\"!A:D\"),2,FALSE)),\"\")","v":""},2.0,null,null,{"$f":"IFERROR(IF(B14=\"\",\"\",VLOOKUP(B14,INDIRECT(A14&\"!A:D\"),3,FALSE)),\"\")","v":""},{"$f":"IF(D14<>\"\",$G$3,\"\")","v":0.41},{"$f":"IFERROR(IF(B14=\"Trashcan\",15,IF(B14=\"TUK\",18,IF(B14=\"\",\"\",VLOOKUP(B14,INDIRECT(A14&\"!A:D\"),4,FALSE)*H14))),\"\")","v":""},{"$f":"IFERROR(IF(I14=\"\",\"\",D14*I14),\"\")","v":""}]
[null,null,"",null,null,null,"","","",""]
["TSW",null,"",null,null,null,"","","",""]
[null,null,"",null,null,null,"","","",""]
[null,null,"",null,null,null,"","","",""]
[null,null,"",null,null,null,"","","",""]
[null,null,"",null,null,null,"","","",""]
{"$rows_left_out":483}
{"sheet":"TSW","index":1,"n_rows":284,"n_cols":4,"rows_kept":284,"cut":false,"hidden":true,"merged":[]}
["Name","Description","Primary Units Type","Base Price"]
["TSW-B12","Base Cabinet - 12\"W 34 1/2\"H 24\"D 1D, 1Drw, 1S","Case",278.0]
["TSW-B15","Base Cabinet - 15\"W 34 1/2\"H 24\"D 1D, 1Drw, 1S","Case",307.0]
["TSW-B18","Base Cabinet - 18\"W 34 1/2\"H 24\"D 1D, 1Drw, 1S","Case",339.00000000000006]
["TSW-B21","Base Cabinet - 21\"W 34 1/2\"H 24\"D 1D, 1Drw, 1S","Case",364.00000000000006]
["TSW-B24","Base Cabinet - 24\"W 34 1/2\"H 24\"D 2D, 1Drw, 1S","Case",407.0]
["TSW-B27","Base Cabinet - 27\"W 34 1/2\"H 24\"D 2D, 1Drw, 1S","Case",448.00000000000006]
["TSW-B30","Base Cabinet - 30\"W 34 1/2\"H 24\"D 2D, 1Drw, 1S","Case",521.0]
["TSW-B33","Base Cabinet - 33\"W 34 1/2\"H 24\"D 2D, 1Drw, 1S","Case",551.0]
["TSW-B36","Base Cabinet - 36\"W 34 1/2\"H 24\"D 2D, 1Drw, 1S","Case",579.0]
["TSW-B39","Base Cabinet - 39\"W 34 1/2\"H 24\"D 2D, 2Drw, 1S","Case",606.0]
["TSW-B42","Base Cabinet - 42\"W 34 1/2\"H 24\"D 2D, 2Drw, 1S","Case",633.0000000000001]
["TSW-B09FH","Base Full Height Cabinet - 09\"W 34 1/2\"H 24\"D 1D","Case",212.0]
["TSW-B12FH","Base Full Height Cabinet - 12\"W 34 1/2\"H 24\"D 1D","Case",273.21800766076683]
["TSW-B15FH","Base Full Height Cabinet - 15\"W 34 1/2\"H 24\"D 1D","Case",301.6355898759295]
["TSW-B18FH","Base Full Height Cabinet - 18\"W 34 1/2\"H 24\"D 1D","Case",329.99259506451085]
["TSW-B21FH","Base Full Height Cabinet - 21\"W 34 1/2\"H 24\"D 1D","Case",351.2261925411339]
["TSW-B24FH","Base Full Height Cabinet - 24\"W 34 1/2\"H 24\"D 2D","Case",404.09654750797205]
["TSW-B27FH","Base Full Height Cabinet - 27\"W 34 1/2\"H 24\"D 2D","Case",428.7195997458999]
["TSW-B30FH","Base Full Height Cabinet - 30\"W 34 1/2\"H 24\"D 2D","Case",496.5318409997678]
{"$rows_left_out":265}
{"sheet":"TSG","index":2,"n_rows":284,"n_cols":4,"rows_kept":284,"cut":false,"hidden":true,"merged":[]}
["Name","Description","Primary Units Type","Base Price"]
["TSG-B12","Base Cabinet - 12\"W 34 1/2\"H 24\"D 1D, 1Drw, 1S","Case",291.90000000000003]
["TSG-B15","Base Cabinet - 15\"W 34 1/2\"H 24\"D 1D, 1Drw, 1S","Case",322.35]
["TSG-B18","Base Cabinet - 18\"W 34 1/2\"H 24\"D 1D, 1Drw, 1S","Case",355.9500000000001]
["TSG-B21","Base Cabinet - 21\"W 34 1/2\"H 24\"D 1D, 1Drw, 1S","Case",382.2000000000001]
["TSG-B24","Base Cabinet - 24\"W 34 1/2\"H 24\"D 2D, 1Drw, 1S","Case",427.35]
["TSG-B27","Base Cabinet - 27\"W 34 1/2\"H 24\"D 2D, 1Drw, 1S","Case",470.4000000000001]
["TSG-B30","Base Cabinet - 30\"W 34 1/2\"H 24\"D 2D, 1Drw, 1S","Case",547.0500000000001]
["TSG-B33","Base Cabinet - 33\"W 34 1/2\"H 24\"D 2D, 1Drw, 1S","Case",578.5500000000001]
["TSG-B36","Base Cabinet - 36\"W 34 1/2\"H 24\"D 2D, 1Drw, 1S","Case",607.95]
["TSG-B39","Base Cabinet - 39\"W 34 1/2\"H 24\"D 2D, 2Drw, 1S","Case",636.3000000000001]
["TSG-B42","Base Cabinet - 42\"W 34 1/2\"H 24\"D 2D, 2Drw, 1S","Case",664.6500000000001]
["TSG-B09FH","Base Full Height Cabinet - 09\"W 34 1/2\"H 24\"D 1D","Case",222.60000000000002]
["TSG-B12FH","Base Full Height Cabinet - 12\"W 34 1/2\"H 24\"D 1D","Case",281.4180076607669]
["TSG-B15FH","Base Full Height Cabinet - 15\"W 34 1/2\"H 24\"D 1D","Case",311.1355898759295]
["TSG-B18FH","Base Full Height Cabinet - 18\"W 34 1/2\"H 24\"D 1D","Case",340.64259506451083]
["TSG-B21FH","Base Full Height Cabinet - 21\"W 34 1/2\"H 24\"D 1D","Case",362.7761925411339]
["TSG-B24FH","Base Full Height Cabinet - 24\"W 34 1/2\"H 24\"D 2D","Case",418.39654750797206]
["TSG-B27FH","Base Full Height Cabinet - 27\"W 34 1/2\"H 24\"D 2D","Case",444.01959974589994]
["TSG-B30FH","Base Full Height Cabinet - 30\"W 34 1/2\"H 24\"D 2D","Case",513.6818409997678]
{"$rows_left_out":265}
{"sheet":"TSB","index":3,"n_rows":284,"n_cols":4,"rows_kept":284,"cut":false,"hidden":true,"merged":[]}
["Name","Description","Primary Units Type","Base Price"]
["TSB-B12","Base Cabinet - 12\"W 34 1/2\"H 24\"D 1D, 1Drw, 1S","Case",291.90000000000003]
["TSB-B15","Base Cabinet - 15\"W 34 1/2\"H 24\"D 1D, 1Drw, 1S","Case",322.35]
["TSB-B18","Base Cabinet - 18\"W 34 1/2\"H 24\"D 1D, 1Drw, 1S","Case",355.9500000000001]
["TSB-B21","Base Cabinet - 21\"W 34 1/2\"H 24\"D 1D, 1Drw, 1S","Case",382.2000000000001]
["TSB-B24","Base Cabinet - 24\"W 34 1/2\"H 24\"D 2D, 1Drw, 1S","Case",427.35]
["TSB-B27","Base Cabinet - 27\"W 34 1/2\"H 24\"D 2D, 1Drw, 1S","Case",470.4000000000001]
["TSB-B30","Base Cabinet - 30\"W 34 1/2\"H 24\"D 2D, 1Drw, 1S","Case",547.0500000000001]
["TSB-B33","Base Cabinet - 33\"W 34 1/2\"H 24\"D 2D, 1Drw, 1S","Case",578.5500000000001]
["TSB-B36","Base Cabinet - 36\"W 34 1/2\"H 24\"D 2D, 1Drw, 1S","Case",607.95]
["TSB-B39","Base Cabinet - 39\"W 34 1/2\"H 24\"D 2D, 2Drw, 1S","Case",636.3000000000001]
["TSB-B42","Base Cabinet - 42\"W 34 1/2\"H 24\"D 2D, 2Drw, 1S","Case",664.6500000000001]
["TSB-B09FH","Base Full Height Cabinet - 09\"W 34 1/2\"H 24\"D 1D","Case",222.60000000000002]
["TSB-B12FH","Base Full Height Cabinet - 12\"W 34 1/2\"H 24\"D 1D","Case",281.4180076607669]
["TSB-B15FH","Base Full Height Cabinet - 15\"W 34 1/2\"H 24\"D 1D","Case",311.1355898759295]
["TSB-B18FH","Base Full Height Cabinet - 18\"W 34 1/2\"H 24\"D 1D","Case",340.64259506451083]
["TSB-B21FH","Base Full Height Cabinet - 21\"W 34 1/2\"H 24\"D 1D","Case",362.7761925411339]
["TSB-B24FH","Base Full Height Cabinet - 24\"W 34 1/2\"H 24\"D 2D","Case",418.39654750797206]
["TSB-B27FH","Base Full Height Cabinet - 27\"W 34 1/2\"H 24\"D 2D","Case",444.01959974589994]
["TSB-B30FH","Base Full Height Cabinet - 30\"W 34 1/2\"H 24\"D 2D","Case",513.6818409997678]
{"$rows_left_out":265}
{"sheet":"TSK","index":4,"n_rows":284,"n_cols":4,"rows_kept":284,"cut":false,"hidden":true,"merged":[]}
["Name","Description","Primary Units Type","Base Price"]
["TSK-B12","Base Cabinet - 12\"W 34 1/2\"H 24\"D 1D, 1Drw, 1S","Case",319.7]
["TSK-B15","Base Cabinet - 15\"W 34 1/2\"H 24\"D 1D, 1Drw, 1S","Case",353.04999999999995]
["TSK-B18","Base Cabinet - 18\"W 34 1/2\"H 24\"D 1D, 1Drw, 1S","Case",389.85]
["TSK-B21","Base Cabinet - 21\"W 34 1/2\"H 24\"D 1D, 1Drw, 1S","Case",418.6]
["TSK-B24","Base Cabinet - 24\"W 34 1/2\"H 24\"D 2D, 1Drw, 1S","Case",468.04999999999995]
["TSK-B27","Base Cabinet - 27\"W 34 1/2\"H 24\"D 2D, 1Drw, 1S","Case",515.2]
["TSK-B30","Base Cabinet - 30\"W 34 1/2\"H 24\"D 2D, 1Drw, 1S","Case",599.15]
["TSK-B33","Base Cabinet - 33\"W 34 1/2\"H 24\"D 2D, 1Drw, 1S","Case",633.65]
["TSK-B36","Base Cabinet - 36\"W 34 1/2\"H 24\"D 2D, 1Drw, 1S","Case",665.8499999999999]
["TSK-B39","Base Cabinet - 39\"W 34 1/2\"H 24\"D 2D, 2Drw, 1S","Case",696.9]
["TSK-B42","Base Cabinet - 42\"W 34 1/2\"H 24\"D 2D, 2Drw, 1S","Case",727.95]
["TSK-B09FH","Base Full Height Cabinet - 09\"W 34 1/2\"H 24\"D 1D","Case",243.79999999999998]
["TSK-B12FH","Base Full Height Cabinet - 12\"W 34 1/2\"H 24\"D 1D","Case",297.81800766076685]
["TSK-B15FH","Base Full Height Cabinet - 15\"W 34 1/2\"H 24\"D 1D","Case",330.13558987592944]
["TSK-B18FH","Base Full Height Cabinet - 18\"W 34 1/2\"H 24\"D 1D","Case",361.9425950645108]
["TSK-B21FH","Base Full Height Cabinet - 21\"W 34 1/2\"H 24\"D 1D","Case",385.8761925411339]
["TSK-B24FH","Base Full Height Cabinet - 24\"W 34 1/2\"H 24\"D 2D","Case",446.996547507972]
["TSK-B27FH","Base Full Height Cabinet - 27\"W 34 1/2\"H 24\"D 2D","Case",474.6195997458999]
["TSK-B30FH","Base Full Height Cabinet - 30\"W 34 1/2\"H 24\"D 2D","Case",547.9818409997678]
{"$rows_left_out":265}
{"sheet":"TSC","index":5,"n_rows":284,"n_cols":4,"rows_kept":284,"cut":false,"hidden":true,"merged":[]}
["Name","Description","Primary Units Type","Base Price"]
["TSC-B12","Base Cabinet - 12\"W 34 1/2\"H 24\"D 1D, 1Drw, 1S","Case",319.7]
["TSC-B15","Base Cabinet - 15\"W 34 1/2\"H 24\"D 1D, 1Drw, 1S","Case",353.04999999999995]
["TSC-B18","Base Cabinet - 18\"W 34 1/2\"H 24\"D 1D, 1Drw, 1S","Case",389.85]
["TSC-B21","Base Cabinet - 21\"W 34 1/2\"H 24\"D 1D, 1Drw, 1S","Case",418.6]
["TSC-B24","Base Cabinet - 24\"W 34 1/2\"H 24\"D 2D, 1Drw, 1S","Case",468.04999999999995]
["TSC-B27","Base Cabinet - 27\"W 34 1/2\"H 24\"D 2D, 1Drw, 1S","Case",515.2]
["TSC-B30","Base Cabinet - 30\"W 34 1/2\"H 24\"D 2D, 1Drw, 1S","Case",599.15]
["TSC-B33","Base Cabinet - 33\"W 34 1/2\"H 24\"D 2D, 1Drw, 1S","Case",633.65]
["TSC-B36","Base Cabinet - 36\"W 34 1/2\"H 24\"D 2D, 1Drw, 1S","Case",665.8499999999999]
["TSC-B39","Base Cabinet - 39\"W 34 1/2\"H 24\"D 2D, 2Drw, 1S","Case",696.9]
["TSC-B42","Base Cabinet - 42\"W 34 1/2\"H 24\"D 2D, 2Drw, 1S","Case",727.95]
["TSC-B09FH","Base Full Height Cabinet - 09\"W 34 1/2\"H 24\"D 1D","Case",243.79999999999998]
["TSC-B12FH","Base Full Height Cabinet - 12\"W 34 1/2\"H 24\"D 1D","Case",297.81800766076685]
["TSC-B15FH","Base Full Height Cabinet - 15\"W 34 1/2\"H 24\"D 1D","Case",330.13558987592944]
["TSC-B18FH","Base Full Height Cabinet - 18\"W 34 1/2\"H 24\"D 1D","Case",361.9425950645108]
["TSC-B21FH","Base Full Height Cabinet - 21\"W 34 1/2\"H 24\"D 1D","Case",385.8761925411339]
["TSC-B24FH","Base Full Height Cabinet - 24\"W 34 1/2\"H 24\"D 2D","Case",446.996547507972]
["TSC-B27FH","Base Full Height Cabinet - 27\"W 34 1/2\"H 24\"D 2D","Case",474.6195997458999]
["TSC-B30FH","Base Full Height Cabinet - 30\"W 34 1/2\"H 24\"D 2D","Case",547.9818409997678]
{"$rows_left_out":265}
{"sheet":"TSO","index":6,"n_rows":284,"n_cols":4,"rows_kept":284,"cut":false,"hidden":true,"merged":[]}
["Name","Description","Primary Units Type","Base Price"]
["TSO-B12","Base Cabinet - 12\"W 34 1/2\"H 24\"D 1D, 1Drw, 1S","Case",834.0]
["TSO-B15","Base Cabinet - 15\"W 34 1/2\"H 24\"D 1D, 1Drw, 1S","Case",921.0]
["TSO-B18","Base Cabinet - 18\"W 34 1/2\"H 24\"D 1D, 1Drw, 1S","Case",1017.0000000000002]
["TSO-B21","Base Cabinet - 21\"W 34 1/2\"H 24\"D 1D, 1Drw, 1S","Case",1092.0000000000002]
["TSO-B24","Base Cabinet - 24\"W 34 1/2\"H 24\"D 2D, 1Drw, 1S","Case",1221.0]
["TSO-B27","Base Cabinet - 27\"W 34 1/2\"H 24\"D 2D, 1Drw, 1S","Case",1344.0000000000002]
["TSO-B30","Base Cabinet - 30\"W 34 1/2\"H 24\"D 2D, 1Drw, 1S","Case",1563.0]
["TSO-B33","Base Cabinet - 33\"W 34 1/2\"H 24\"D 2D, 1Drw, 1S","Case",1653.0]
["TSO-B36","Base Cabinet - 36\"W 34 1/2\"H 24\"D 2D, 1Drw, 1S","Case",1737.0]
["TSO-B39","Base Cabinet - 39\"W 34 1/2\"H 24\"D 2D, 2Drw, 1S","Case",1818.0]
["TSO-B42","Base Cabinet - 42\"W 34 1/2\"H 24\"D 2D, 2Drw, 1S","Case",1899.0000000000005]
["TSO-B09FH","Base Full Height Cabinet - 09\"W 34 1/2\"H 24\"D 1D","Case",600.0]
["TSO-B12FH","Base Full Height Cabinet - 12\"W 34 1/2\"H 24\"D 1D","Case",601.2180076607668]
["TSO-B15FH","Base Full Height Cabinet - 15\"W 34 1/2\"H 24\"D 1D","Case",681.6355898759294]
["TSO-B18FH","Base Full Height Cabinet - 18\"W 34 1/2\"H 24\"D 1D","Case",755.9925950645109]
["TSO-B21FH","Base Full Height Cabinet - 21\"W 34 1/2\"H 24\"D 1D","Case",813.226192541134]
["TSO-B24FH","Base Full Height Cabinet - 24\"W 34 1/2\"H 24\"D 2D","Case",976.0965475079721]
["TSO-B27FH","Base Full Height Cabinet - 27\"W 34 1/2\"H 24\"D 2D","Case",1040.7195997458998]
["TSO-B30FH","Base Full Height Cabinet - 30\"W 34 1/2\"H 24\"D 2D","Case",1182.5318409997678]
{"$rows_left_out":265}
{"sheet":"DBG","index":7,"n_rows":284,"n_cols":4,"rows_kept":284,"cut":false,"hidden":true,"merged":[]}
["Name","Description","Primary Units Type","Base Price"]
["DBG-B12","Base Cabinet - 12\"W 34 1/2\"H 24\"D 1D, 1Drw, 1S","Case",291.90000000000003]
["DBG-B15","Base Cabinet - 15\"W 34 1/2\"H 24\"D 1D, 1Drw, 1S","Case",322.35]
["DBG-B18","Base Cabinet - 18\"W 34 1/2\"H 24\"D 1D, 1Drw, 1S","Case",355.9500000000001]
["DBG-B21","Base Cabinet - 21\"W 34 1/2\"H 24\"D 1D, 1Drw, 1S","Case",382.2000000000001]
["DBG-B24","Base Cabinet - 24\"W 34 1/2\"H 24\"D 2D, 1Drw, 1S","Case",427.35]
["DBG-B27","Base Cabinet - 27\"W 34 1/2\"H 24\"D 2D, 1Drw, 1S","Case",470.4000000000001]
["DBG-B30","Base Cabinet - 30\"W 34 1/2\"H 24\"D 2D, 1Drw, 1S","Case",547.0500000000001]
["DBG-B33","Base Cabinet - 33\"W 34 1/2\"H 24\"D 2D, 1Drw, 1S","Case",578.5500000000001]
["DBG-B36","Base Cabinet - 36\"W 34 1/2\"H 24\"D 2D, 1Drw, 1S","Case",607.95]
["DBG-B39","Base Cabinet - 39\"W 34 1/2\"H 24\"D 2D, 2Drw, 1S","Case",636.3000000000001]
["DBG-B42","Base Cabinet - 42\"W 34 1/2\"H 24\"D 2D, 2Drw, 1S","Case",664.6500000000001]
["DBG-B09FH","Base Full Height Cabinet - 09\"W 34 1/2\"H 24\"D 1D","Case",222.60000000000002]
["DBG-B12FH","Base Full Height Cabinet - 12\"W 34 1/2\"H 24\"D 1D","Case",281.4180076607669]
["DBG-B15FH","Base Full Height Cabinet - 15\"W 34 1/2\"H 24\"D 1D","Case",311.1355898759295]
["DBG-B18FH","Base Full Height Cabinet - 18\"W 34 1/2\"H 24\"D 1D","Case",340.64259506451083]
["DBG-B21FH","Base Full Height Cabinet - 21\"W 34 1/2\"H 24\"D 1D","Case",362.7761925411339]
["DBG-B24FH","Base Full Height Cabinet - 24\"W 34 1/2\"H 24\"D 2D","Case",418.39654750797206]
["DBG-B27FH","Base Full Height Cabinet - 27\"W 34 1/2\"H 24\"D 2D","Case",444.01959974589994]
["DBG-B30FH","Base Full Height Cabinet - 30\"W 34 1/2\"H 24\"D 2D","Case",513.6818409997678]
{"$rows_left_out":265}
{"sheet":"DCB","index":8,"n_rows":284,"n_cols":4,"rows_kept":284,"cut":false,"hidden":true,"merged":[]}
["Name","Description","Primary Units Type","Base Price"]
["DCB-B12","Base Cabinet - 12\"W 34 1/2\"H 24\"D 1D, 1Drw, 1S","Case",319.7]
["DCB-B15","Base Cabinet - 15\"W 34 1/2\"H 24\"D 1D, 1Drw, 1S","Case",353.04999999999995]
["DCB-B18","Base Cabinet - 18\"W 34 1/2\"H 24\"D 1D, 1Drw, 1S","Case",389.85]
["DCB-B21","Base Cabinet - 21\"W 34 1/2\"H 24\"D 1D, 1Drw, 1S","Case",418.6]
["DCB-B24","Base Cabinet - 24\"W 34 1/2\"H 24\"D 2D, 1Drw, 1S","Case",468.04999999999995]
["DCB-B27","Base Cabinet - 27\"W 34 1/2\"H 24\"D 2D, 1Drw, 1S","Case",515.2]
["DCB-B30","Base Cabinet - 30\"W 34 1/2\"H 24\"D 2D, 1Drw, 1S","Case",599.15]
["DCB-B33","Base Cabinet - 33\"W 34 1/2\"H 24\"D 2D, 1Drw, 1S","Case",633.65]
["DCB-B36","Base Cabinet - 36\"W 34 1/2\"H 24\"D 2D, 1Drw, 1S","Case",665.8499999999999]
["DCB-B39","Base Cabinet - 39\"W 34 1/2\"H 24\"D 2D, 2Drw, 1S","Case",696.9]
["DCB-B42","Base Cabinet - 42\"W 34 1/2\"H 24\"D 2D, 2Drw, 1S","Case",727.95]
["DCB-B09FH","Base Full Height Cabinet - 09\"W 34 1/2\"H 24\"D 1D","Case",243.79999999999998]
["DCB-B12FH","Base Full Height Cabinet - 12\"W 34 1/2\"H 24\"D 1D","Case",297.81800766076685]
["DCB-B15FH","Base Full Height Cabinet - 15\"W 34 1/2\"H 24\"D 1D","Case",330.13558987592944]
["DCB-B18FH","Base Full Height Cabinet - 18\"W 34 1/2\"H 24\"D 1D","Case",361.9425950645108]
["DCB-B21FH","Base Full Height Cabinet - 21\"W 34 1/2\"H 24\"D 1D","Case",385.8761925411339]
["DCB-B24FH","Base Full Height Cabinet - 24\"W 34 1/2\"H 24\"D 2D","Case",446.996547507972]
["DCB-B27FH","Base Full Height Cabinet - 27\"W 34 1/2\"H 24\"D 2D","Case",474.6195997458999]
["DCB-B30FH","Base Full Height Cabinet - 30\"W 34 1/2\"H 24\"D 2D","Case",547.9818409997678]
{"$rows_left_out":265}
{"sheet":"CDW","index":9,"n_rows":284,"n_cols":4,"rows_kept":284,"cut":false,"hidden":true,"merged":[]}
["Name","Description","Primary Units Type","Base Price"]
["CDW-B12","Base Cabinet - 12\"W 34 1/2\"H 24\"D 1D, 1Drw, 1S","Case",305.8]
["CDW-B15","Base Cabinet - 15\"W 34 1/2\"H 24\"D 1D, 1Drw, 1S","Case",337.70000000000005]
["CDW-B18","Base Cabinet - 18\"W 34 1/2\"H 24\"D 1D, 1Drw, 1S","Case",372.9000000000001]
["CDW-B21","Base Cabinet - 21\"W 34 1/2\"H 24\"D 1D, 1Drw, 1S","Case",400.4000000000001]
["CDW-B24","Base Cabinet - 24\"W 34 1/2\"H 24\"D 2D, 1Drw, 1S","Case",447.70000000000005]
["CDW-B27","Base Cabinet - 27\"W 34 1/2\"H 24\"D 2D, 1Drw, 1S","Case",492.8000000000001]
["CDW-B30","Base Cabinet - 30\"W 34 1/2\"H 24\"D 2D, 1Drw, 1S","Case",573.1]
["CDW-B33","Base Cabinet - 33\"W 34 1/2\"H 24\"D 2D, 1Drw, 1S","Case",606.1]
["CDW-B36","Base Cabinet - 36\"W 34 1/2\"H 24\"D 2D, 1Drw, 1S","Case",636.9000000000001]
["CDW-B39","Base Cabinet - 39\"W 34 1/2\"H 24\"D 2D, 2Drw, 1S","Case",666.6]
["CDW-B42","Base Cabinet - 42\"W 34 1/2\"H 24\"D 2D, 2Drw, 1S","Case",696.3000000000002]
["CDW-B09FH","Base Full Height Cabinet - 09\"W 34 1/2\"H 24\"D 1D","Case",233.20000000000002]
["CDW-B12FH","Base Full Height Cabinet - 12\"W 34 1/2\"H 24\"D 1D","Case",289.61800766076686]
["CDW-B15FH","Base Full Height Cabinet - 15\"W 34 1/2\"H 24\"D 1D","Case",320.6355898759295]
["CDW-B18FH","Base Full Height Cabinet - 18\"W 34 1/2\"H 24\"D 1D","Case",351.2925950645108]
["CDW-B21FH","Base Full Height Cabinet - 21\"W 34 1/2\"H 24\"D 1D","Case",374.32619254113393]
["CDW-B24FH","Base Full Height Cabinet - 24\"W 34 1/2\"H 24\"D 2D","Case",432.69654750797207]
["CDW-B27FH","Base Full Height Cabinet - 27\"W 34 1/2\"H 24\"D 2D","Case",459.31959974589995]
["CDW-B30FH","Base Full Height Cabinet - 30\"W 34 1/2\"H 24\"D 2D","Case",530.8318409997678]
{"$rows_left_out":265}
{"sheet":"CTG","index":10,"n_rows":284,"n_cols":4,"rows_kept":284,"cut":false,"hidden":true,"merged":[]}
["Name","Description","Primary Units Type","Base Price"]
["CTG-B12","Base Cabinet - 12\"W 34 1/2\"H 24\"D 1D, 1Drw, 1S","Case",305.8]
["CTG-B15","Base Cabinet - 15\"W 34 1/2\"H 24\"D 1D, 1Drw, 1S","Case",337.70000000000005]
["CTG-B18","Base Cabinet - 18\"W 34 1/2\"H 24\"D 1D, 1Drw, 1S","Case",372.9000000000001]
["CTG-B21","Base Cabinet - 21\"W 34 1/2\"H 24\"D 1D, 1Drw, 1S","Case",400.4000000000001]
["CTG-B24","Base Cabinet - 24\"W 34 1/2\"H 24\"D 2D, 1Drw, 1S","Case",447.70000000000005]
["CTG-B27","Base Cabinet - 27\"W 34 1/2\"H 24\"D 2D, 1Drw, 1S","Case",492.8000000000001]
["CTG-B30","Base Cabinet - 30\"W 34 1/2\"H 24\"D 2D, 1Drw, 1S","Case",573.1]
["CTG-B33","Base Cabinet - 33\"W 34 1/2\"H 24\"D 2D, 1Drw, 1S","Case",606.1]
["CTG-B36","Base Cabinet - 36\"W 34 1/2\"H 24\"D 2D, 1Drw, 1S","Case",636.9000000000001]
["CTG-B39","Base Cabinet - 39\"W 34 1/2\"H 24\"D 2D, 2Drw, 1S","Case",666.6]
["CTG-B42","Base Cabinet - 42\"W 34 1/2\"H 24\"D 2D, 2Drw, 1S","Case",696.3000000000002]
["CTG-B09FH","Base Full Height Cabinet - 09\"W 34 1/2\"H 24\"D 1D","Case",233.20000000000002]
["CTG-B12FH","Base Full Height Cabinet - 12\"W 34 1/2\"H 24\"D 1D","Case",289.61800766076686]
["CTG-B15FH","Base Full Height Cabinet - 15\"W 34 1/2\"H 24\"D 1D","Case",320.6355898759295]
["CTG-B18FH","Base Full Height Cabinet - 18\"W 34 1/2\"H 24\"D 1D","Case",351.2925950645108]
["CTG-B21FH","Base Full Height Cabinet - 21\"W 34 1/2\"H 24\"D 1D","Case",374.32619254113393]
["CTG-B24FH","Base Full Height Cabinet - 24\"W 34 1/2\"H 24\"D 2D","Case",432.69654750797207]
["CTG-B27FH","Base Full Height Cabinet - 27\"W 34 1/2\"H 24\"D 2D","Case",459.31959974589995]
["CTG-B30FH","Base Full Height Cabinet - 30\"W 34 1/2\"H 24\"D 2D","Case",530.8318409997678]
{"$rows_left_out":265}
{"sheet":"CWO","index":11,"n_rows":284,"n_cols":4,"rows_kept":284,"cut":false,"hidden":true,"merged":[]}
["Name","Description","Primary Units Type","Base Price"]
["CWO-B12","Base Cabinet - 12\"W 34 1/2\"H 24\"D 1D, 1Drw, 1S","Case",556.0]
["CWO-B15","Base Cabinet - 15\"W 34 1/2\"H 24\"D 1D, 1Drw, 1S","Case",614.0]
["CWO-B18","Base Cabinet - 18\"W 34 1/2\"H 24\"D 1D, 1Drw, 1S","Case",678.0000000000001]
["CWO-B21","Base Cabinet - 21\"W 34 1/2\"H 24\"D 1D, 1Drw, 1S","Case",728.0000000000001]
["CWO-B24","Base Cabinet - 24\"W 34 1/2\"H 24\"D 2D, 1Drw, 1S","Case",814.0]
["CWO-B27","Base Cabinet - 27\"W 34 1/2\"H 24\"D 2D, 1Drw, 1S","Case",896.0000000000001]
["CWO-B30","Base Cabinet - 30\"W 34 1/2\"H 24\"D 2D, 1Drw, 1S","Case",1042.0]
["CWO-B33","Base Cabinet - 33\"W 34 1/2\"H 24\"D 2D, 1Drw, 1S","Case",1102.0]
["CWO-B36","Base Cabinet - 36\"W 34 1/2\"H 24\"D 2D, 1Drw, 1S","Case",1158.0]
["CWO-B39","Base Cabinet - 39\"W 34 1/2\"H 24\"D 2D, 2Drw, 1S","Case",1212.0]
["CWO-B42","Base Cabinet - 42\"W 34 1/2\"H 24\"D 2D, 2Drw, 1S","Case",1266.0000000000002]
["CWO-B09FH","Base Full Height Cabinet - 09\"W 34 1/2\"H 24\"D 1D","Case",424.0]
["CWO-B12FH","Base Full Height Cabinet - 12\"W 34 1/2\"H 24\"D 1D","Case",437.21800766076683]
["CWO-B15FH","Base Full Height Cabinet - 15\"W 34 1/2\"H 24\"D 1D","Case",491.63558987592944]
["CWO-B18FH","Base Full Height Cabinet - 18\"W 34 1/2\"H 24\"D 1D","Case",542.9925950645109]
["CWO-B21FH","Base Full Height Cabinet - 21\"W 34 1/2\"H 24\"D 1D","Case",582.226192541134]
["CWO-B24FH","Base Full Height Cabinet - 24\"W 34 1/2\"H 24\"D 2D","Case",690.0965475079721]
["CWO-B27FH","Base Full Height Cabinet - 27\"W 34 1/2\"H 24\"D 2D","Case",734.7195997458999]
["CWO-B30FH","Base Full Height Cabinet - 30\"W 34 1/2\"H 24\"D 2D","Case",839.5318409997678]
{"$rows_left_out":265}
{"sheet":"NSB","index":12,"n_rows":284,"n_cols":4,"rows_kept":284,"cut":false,"hidden":true,"merged":[]}
["Name","Description","Primary Units Type","Base Price"]
["NSB-B12","Base Cabinet - 12\"W 34 1/2\"H 24\"D 1D, 1Drw, 1S","Case",305.8]
["NSB-B15","Base Cabinet - 15\"W 34 1/2\"H 24\"D 1D, 1Drw, 1S","Case",337.70000000000005]
["NSB-B18","Base Cabinet - 18\"W 34 1/2\"H 24\"D 1D, 1Drw, 1S","Case",372.9000000000001]
["NSB-B21","Base Cabinet - 21\"W 34 1/2\"H 24\"D 1D, 1Drw, 1S","Case",400.4000000000001]
["NSB-B24","Base Cabinet - 24\"W 34 1/2\"H 24\"D 2D, 1Drw, 1S","Case",447.70000000000005]
["NSB-B27","Base Cabinet - 27\"W 34 1/2\"H 24\"D 2D, 1Drw, 1S","Case",492.8000000000001]
["NSB-B30","Base Cabinet - 30\"W 34 1/2\"H 24\"D 2D, 1Drw, 1S","Case",573.1]
["NSB-B33","Base Cabinet - 33\"W 34 1/2\"H 24\"D 2D, 1Drw, 1S","Case",606.1]
["NSB-B36","Base Cabinet - 36\"W 34 1/2\"H 24\"D 2D, 1Drw, 1S","Case",636.9000000000001]
["NSB-B39","Base Cabinet - 39\"W 34 1/2\"H 24\"D 2D, 2Drw, 1S","Case",666.6]
["NSB-B42","Base Cabinet - 42\"W 34 1/2\"H 24\"D 2D, 2Drw, 1S","Case",696.3000000000002]
["NSB-B09FH","Base Full Height Cabinet - 09\"W 34 1/2\"H 24\"D 1D","Case",233.20000000000002]
["NSB-B12FH","Base Full Height Cabinet - 12\"W 34 1/2\"H 24\"D 1D","Case",289.61800766076686]
["NSB-B15FH","Base Full Height Cabinet - 15\"W 34 1/2\"H 24\"D 1D","Case",320.6355898759295]
["NSB-B18FH","Base Full Height Cabinet - 18\"W 34 1/2\"H 24\"D 1D","Case",351.2925950645108]
["NSB-B21FH","Base Full Height Cabinet - 21\"W 34 1/2\"H 24\"D 1D","Case",374.32619254113393]
["NSB-B24FH","Base Full Height Cabinet - 24\"W 34 1/2\"H 24\"D 2D","Case",432.69654750797207]
["NSB-B27FH","Base Full Height Cabinet - 27\"W 34 1/2\"H 24\"D 2D","Case",459.31959974589995]
["NSB-B30FH","Base Full Height Cabinet - 30\"W 34 1/2\"H 24\"D 2D","Case",530.8318409997678]
{"$rows_left_out":264}